Year,Jurisdiction,Jur_Name,Parcel_ID,Account,Ownership_Sequence,Owner_Id,Owner_Prefix,Name,Careof,Street,Street_Overflow,City,State,Zip5,Zip4,Location_Code,Jur 1,Jur 2,Jur 3,Jur 4,Jur 5,Jur 6,Jur 7,Jur 8,Jur 9,Jur 10,Jur 11,Jur 12,Is_Exempt,Prop_Street_Number,Prop_Street,Prop_Street_Dir,Prop_City,Prop_State,Prop_Zip5,Prop_Zip4,Map1,Map2,Is_Protested,Has_Hs_Link,Primary_Category_Code,Secondary_Category_Code,Third_Category_Code,DBA,Interest,Ceiling_Year,Ceiling_Tax,Homestead_Code,Agent_Code,Agent_Name,Acres,Legal1,Legal2,Legal3,Legal4,Mortgage_Code,Lease_Number,Lease_Name,Operator_Name,RRC_Number,Interest_Type,Land_Hs,Land_Nhs,Land_Productivity_Market,Land_1d1,Land_1d,Land_Timber,Personal_Hs,Personal_Nhs,Market_Value,Net_Taxable_Value,State_Homestead,State_Mandated_Over65,State_Mandated_Disabled,Optional65,Local_Disabled,Road_Homestead,Disabled_Veteran,New_Personal_Hs,New_Personal_Nhs,Improvement_Hs,New_Improvement_Hs,Improvement_Nhs,New_Improvement_Nhs,Is_Owner_Confidential,Local_Discount,Has_Abatement,Has_Miscellaneous_Exemption,Abatement_Value,Mineral_Freeport_Value,Mineral_Unknown_Value
2021,01,Coke Cad,1001,1-22-000010446001000000,1,2425,R,JJH NON-GS TRUST U/W OF,JERALDINE HICKMAN,P O BOX 278,,BRONTE,TX,76933,0000,22,01,02,04,05,11,24,,,,,,,False,,,,,TX,,,,,False,False,D1,,,,0.320000,0,0.00,,,,20.2560,ABST 1,SEC 446,C L ASSMANN,,43,,,,,,0,0,20260,1620,0,0,0,0,20260,1620,0,0,0,0,0,0,0,0,0,0,0,0,0,False,0,False,False,0,0,0
2021,01,Coke Cad,1001,1-22-000010446001000000,2,3941,R,WAH NON-GS TRUST U/W OF,W A HICKMAN,PO BOX 278,,BRONTE,TX,76933,0000,22,01,02,04,05,11,24,,,,,,,False,,,,,TX,,,,,False,False,D1,,,,0.680000,0,0.00,,,,43.0440,ABST 1,SEC 446,C L ASSMANN,,43,,,,,,0,0,43040,3440,0,0,0,0,43040,3440,0,0,0,0,0,0,0,0,0,0,0,0,0,False,0,False,False,0,0,0
2021,01,Coke Cad,1002,1-22-000010446002000000,1,8046,R,LEWIS AZ TX PROPERTIES LLC,,6431 E SHEPHERD HILLS,,TUCSON,AZ,85710,,22,01,02,04,05,11,24,,,,,,,False,,,,,TX,,,,,False,False,D1,,,,0.095500,0,0.00,,,,10.7820,ABST 1,SEC 446,C L ASSMANN,,,,,,,,0,0,14080,870,0,0,0,0,14080,870,0,0,0,0,0,0,0,0,0,0,0,0,0,False,0,False,False,0,0,0
2021,01,Coke Cad,1002,1-22-000010446002000000,2,8047,R,LEWIS HOLDINGS COKE COUNTY LLC,,6431 E SHEPHERD HILLS,,TUCSON,AZ,85710,1124,22,01,02,04,05,11,24,,,,,,,False,,,,,TX,,,,,False,False,D1,,,,0.904500,0,0.00,,,,102.1181,ABST 1,SEC 446,C L ASSMANN,,,,,,,,0,0,133340,8260,0,0,0,0,133340,8260,0,0,0,0,0,0,0,0,0,0,0,0,0,False,0,False,False,0,0,0
2021,01,Coke Cad,1005,1-22-000020447001000000,1,2425,R,JJH NON-GS TRUST U/W OF,JERALDINE HICKMAN,P O BOX 278,,BRONTE,TX,76933,0000,22,01,02,04,05,11,24,,,,,,,False,,,,,TX,,,,,False,False,D1,,,,0.320000,0,0.00,,,,53.6320,ABST 2,SEC 447,C L ASSMANN,,43,,,,,,0,0,55870,3710,0,0,0,0,55870,3710,0,0,0,0,0,0,0,0,0,0,0,0,0,False,0,False,False,0,0,0
2021,01,Coke Cad,1005,1-22-000020447001000000,2,3941,R,WAH NON-GS TRUST U/W OF,W A HICKMAN,PO BOX 278,,BRONTE,TX,76933,0000,22,01,02,04,05,11,24,,,,,,,False,,,,,TX,,,,,False,False,D1,,,,0.680000,0,0.00,,,,113.9680,ABST 2,SEC 447,C L ASSMANN,,43,,,,,,0,0,118730,7890,0,0,0,0,118730,7890,0,0,0,0,0,0,0,0,0,0,0,0,0,False,0,False,False,0,0,0
2021,01,Coke Cad,1007,1-22-000030448001000000,1,2425,R,JJH NON-GS TRUST U/W OF,JERALDINE HICKMAN,P O BOX 278,,BRONTE,TX,76933,0000,22,01,02,04,05,11,24,,,,,,,False,,,,,TX,,,,,False,False,D1,,,,0.320000,0,0.00,,,,109.8880,ABST 3,SEC 448,EMIL ALLSTETTER,,43,,,,,,0,0,113780,6350,0,0,0,0,113780,6350,0,0,0,0,0,0,0,0,0,0,0,0,0,False,0,False,False,0,0,0
2021,01,Coke Cad,1007,1-22-000030448001000000,2,3941,R,WAH NON-GS TRUST U/W OF,W A HICKMAN,PO BOX 278,,BRONTE,TX,76933,0000,22,01,02,04,05,11,24,,,,,,,False,,,,,TX,,,,,False,False,D1,,,,0.680000,0,0.00,,,,233.5120,ABST 3,SEC 448,EMIL ALLSTETTER,,43,,,,,,0,0,241780,13480,0,0,0,0,241780,13480,0,0,0,0,0,0,0,0,0,0,0,0,0,False,0,False,False,0,0,0
2021,01,Coke Cad,1009,1-30-000040005001000000,1,3571,R,SHELVING ROCK RANCH LTD,SCOTT BARBER,PO BOX 391,,SAN ANGELO,TX,76902,,30,01,02,04,05,10,20,,,,,,,False,,,,,TX,,,,,False,False,D1,,,,1.000000,0,0.00,,,,315.3000,ABST 4,SEC 5,J. ALEXANDER,,,,,,,,0,0,294170,12960,0,0,0,0,294170,12960,0,0,0,0,0,0,0,0,0,0,0,0,0,False,0,False,False,0,0,0
2021,01,Coke Cad,1010,1-22-000050017001000000,1,4106,R,WILLICK RANCH,,ALAN M GOLDBERG,100 BRAMBLE BROOK RD,ARDSLEY,NY,10502,0000,22,01,02,04,05,11,24,,,,,,,False,,,,,TX,,,,,False,False,D1,,,,1.000000,0,0.00,,,,960.0000,ABST 5,SEC 17.5,J. ARMSTRONG,,,,,,,,0,0,1038750,39660,0,0,0,0,1038750,39660,0,0,0,0,0,0,0,0,0,0,0,0,0,False,0,False,False,0,0,0
2021,01,Coke Cad,1011,1-11-000060003001000000,1,1132,R,AUSTIN TRAVIS ELI,,3203 LEOPARD DR,,TEXARKANA,TX,75501,0000,11,01,02,04,05,10,23,,,,,,,False,,,,,TX,,,,,False,False,D1,,,,1.000000,0,0.00,,,,80.0000,ABST 6,SEC 3,THOMAS ADKINS,,,,,,,,0,0,102760,3640,0,0,0,0,102760,3640,0,0,0,0,0,0,0,0,0,0,0,0,0,False,0,False,False,0,0,0
2021,01,Coke Cad,1012,1-20-000070001001000000,1,3510,R,SCOTT DAVID,,P O BOX 243,,BRONTE,TX,76933,,20,01,02,04,05,12,11,14,24,,,,,False,,,,,TX,,,,,False,False,A4,,,,1.000000,0,0.00,,,,0.3300,ABST 7,SEC 1,A J ADAMS,BRONTE,,,,,,,0,500,0,0,0,0,0,0,9110,9110,0,0,0,0,0,0,0,0,0,0,0,8610,0,False,0,False,False,0,0,0
2021,01,Coke Cad,1013,1-20-000070001002000000,1,1354,R,BRASWELL SHARON KAY,,802 MESQUITE STREET,,BRONTE,TX,76933,,20,01,02,04,05,12,11,14,24,,,,,False,516,JEFFERSON ST,S,BRONTE,TX,76933,,,,False,False,A1,,,,1.000000,0,0.00,,,,0.7500,ABST 7  SEC 1,A J ADAMS   BRONTE,"S/30 OF 1,2,3,4",BLK 83  OT BRONTE,,,,,,,0,1880,0,0,0,0,0,0,15080,15080,0,0,0,0,0,0,0,0,0,0,0,13200,0,False,0,False,False,0,0,0
2021,01,Coke Cad,1014,1-20-000070001003000000,1,1919,R,EUBANKS SID,,118 KICKAPOO RD,,BRONTE,TX,76933,0000,20,01,02,04,05,12,11,14,24,,,,,False,,,,,TX,,,,,False,False,E,,,,1.000000,0,0.00,,,,1.9000,"PT OF TR 2, PT OF",TR 4,ABST 7  SEC 1,A J ADAMS,,,,,,,0,2140,0,0,0,0,0,0,2140,2140,0,0,0,0,0,0,0,0,0,0,0,0,0,False,0,False,False,0,0,0
2021,01,Coke Cad,1015,1-20-000070001004000000,1,3110,R,PAIRISH JANSON B ETAL,,1206 N OKLAHOMA,,FT STOCKTON,TX,79735,0000,20,01,02,04,05,12,11,14,24,,,,,False,,,,,TX,,,,,False,False,E,,,,1.000000,0,0.00,,,,2.8000,ABST 7,SEC 1,A J ADAMS,BRONTE,,,,,,,0,4200,0,0,0,0,0,0,4200,4200,0,0,0,0,0,0,0,0,0,0,0,0,0,False,0,False,False,0,0,0
2021,01,Coke Cad,1016,1-20-000070001005000000,1,7841,R,BRONTE ISD,,P O BOX 670,,BRONTE,TX,76933,,20,01,02,04,05,12,11,14,24,,,,,True,,,,,TX,,,,,False,False,XV,,,,1.000000,0,0.00,,,,2.4000,ABST 7,SEC 1,A J ADAMS,BRONTE,,,,,,,0,31200,0,0,0,0,0,0,41200,0,0,0,0,0,0,0,0,0,0,0,0,0,10000,False,0,False,False,0,0,0
2021,01,Coke Cad,1017,1-20-000070001006000000,1,1399,R,BROWN DANA LEE ETAL,,822 W MAIN ST,,BRONTE,TX,76933,,20,01,02,04,05,12,11,14,24,,,,,False,,,,,TX,,,,,False,False,C1,,,,1.000000,0,0.00,,,,0.5850,ABST 7,SEC 1,A J ADAMS,PT OF TR 2,,,,,,,0,1460,0,0,0,0,0,0,1460,1460,0,0,0,0,0,0,0,0,0,0,0,0,0,False,0,False,False,0,0,0
2021,01,Coke Cad,1018,1-20-000090002001000000,1,1299,R,BNSF RAILWAY COMPANY,,PROPERTY TAX DEPT,P O BOX 961089,FORT WORTH,TX,76161,0000,20,01,02,04,05,12,11,14,24,,,,,False,,,,,TX,,,,,False,False,J5,,,,1.000000,0,0.00,,,,3.1000,ABST 9,SEC 2,I E ADAMS,BRONTE,,,,,,,0,3100,0,0,0,0,0,0,3100,3100,0,0,0,0,0,0,0,0,0,0,0,0,0,False,0,False,False,0,0,0
2021,01,Coke Cad,1019,1-20-000090002002000000,1,1636,R,COKE COUNTY ROPING ASSC,,P O BOX 271,,BRONTE,TX,76933,0000,20,01,02,04,05,12,11,14,24,,,,,False,205,ROPING ARENA RD,,,TX,,,,,False,False,F1,,,,1.000000,0,0.00,,,,5.6000,ABST 9,SEC 2,I E ADAMS,,,,,,,,0,8400,0,0,0,0,0,0,16790,16790,0,0,0,0,0,0,0,0,0,0,0,8390,0,False,0,False,False,0,0,0
2021,01,Coke Cad,1020,1-20-000090002003000000,1,8184,R,HOGAN JEROME & GINA,,P O BOX 382,,BRONTE,TX,76933,,20,01,02,04,05,12,11,14,24,,,,,False,911,JACKSON AVE,W,,TX,,,,,False,False,A4,,,,1.000000,0,0.00,,,,2.0000,ABST 9,SEC 2,I E ADAMS,BRONTE,,,,,,,0,3210,0,0,0,0,0,0,9590,9590,0,0,0,0,0,0,0,0,0,0,0,6380,0,False,0,False,False,0,0,0
2021,01,Coke Cad,1021,1-20-000090002005000000,1,4186,R,WTG JAMESON LP,AFFILIATED TAX CONS,P O BOX 1627,,HENDERSON,TX,75653,0000,20,01,02,04,05,12,11,14,24,,,,,False,209,RAILROAD ST,NE,,TX,,,,,False,False,F2,,,,1.000000,0,0.00,,,,4.4500,ABST 9,SEC 2,I E ADAMS,,,,,,,,0,7140,0,0,0,0,0,0,256570,256570,0,0,0,0,0,0,0,0,0,0,0,249430,0,False,0,False,False,0,0,0
2021,01,Coke Cad,1023,1-22-000120017000500000,1,9537,R,AGUSTIN PASTOR-OLIA,,1010 E 40TH ST,,SAN ANGELO,TX,76903,,22,01,02,04,05,11,24,,,,,,,False,,,,,TX,,,,,False,False,D1,,,,1.000000,0,0.00,,,,0.3700,ABST 12,SEC 17,A B & M,,,,,,,,0,0,720,20,0,0,0,0,720,20,0,0,0,0,0,0,0,0,0,0,0,0,0,False,0,False,False,0,0,0
2021,01,Coke Cad,1024,1-22-000120017001000000,1,9108,R,TXCT INVESTMENTS LLC,,2405 TEXLAND CR,,MIDLAND,TX,79705,,22,01,02,04,05,11,24,,,,,,,False,,,,,TX,,,,,False,False,D1,,,,1.000000,0,0.00,,,,460.3300,ABST 12,SEC 17,A B & M,,,,,,,,0,0,545840,36710,0,0,0,0,545840,36710,0,0,0,0,0,0,0,0,0,0,0,0,0,False,0,False,False,0,0,0
2021,01,Coke Cad,1026,1-22-000120017003000000,1,2399,R,JAMES EARLENE,,P O BOX 1033,,FRIENDSWOOD,TX,77549,,22,01,02,04,05,11,24,,,,,,,False,,,,,TX,,,H6-1,PL-4,False,False,D1,D2,,,1.000000,0,0.00,,,,168.0000,ABST 12,SEC 17,A B & M,,,,,,,,0,0,228040,11780,0,0,0,0,229610,13350,0,0,0,0,0,0,0,0,0,0,0,1570,0,False,0,False,False,0,0,0
2021,01,Coke Cad,1029,1-22-000120017005000000,1,1125,R,AT&T COMMUNICATIONS INC,AT&T PROP TAX DEPT,909 CHESTNUT ST,,ST LOUIS,MO,63101,0000,22,01,02,04,05,11,24,,,,,,,False,125,F M RD 2333,,TENNYSON,TX,76953,,,,False,False,J5,,,,1.000000,0,0.00,,,,0.3100,ABST 12,SEC 17,A B & M,,,,,,,,0,1550,0,0,0,0,0,0,1550,1550,0,0,0,0,0,0,0,0,0,0,0,0,0,False,0,False,False,0,0,0
2021,01,Coke Cad,1030,1-11-000130001001000000,1,2920,R,MILLICAN WALDON,,11681 W ST HWY 158,,ROBERT LEE,TX,76945,0000,11,01,02,04,05,10,23,,,,,,,False,,,,,TX,,,E4-10,PL-1,False,False,D1,D2,,,1.000000,0,0.00,,,,334.3700,ABST 13,SEC 1,G. ALLEN,,,,,,,,0,0,358830,20920,0,0,0,0,401650,63740,0,0,0,0,0,0,0,0,0,0,0,42820,0,False,0,False,False,0,0,0
2021,01,Coke Cad,1034,1-11-000130001003000000,1,1650,R,COMPTON DICK G,,P O BOX 3886,,SAN ANGELO,TX,76902,0000,11,01,02,04,05,10,23,,,,,,,False,,,,,TX,,,,PL-1,False,False,D1,,,,1.000000,0,0.00,,,,675.6300,ABST 13,SEC 1,G. ALLEN,,,,,,,,0,0,797930,29340,0,0,0,0,797930,29340,0,0,0,0,0,0,0,0,0,0,0,0,0,False,0,False,False,0,0,0
2021,01,Coke Cad,1035,1-12-000150030001000000,1,9280,R,POE DAVID ANDREW & BRANDI ELIZABETH,,2686 SLEEPY HOLLOW RD,,SAN ANGELO,TX,76904,,12,01,02,04,05,11,23,,,,,,,False,,,,,TX,,,,,False,False,D1W,,,,1.000000,0,0.00,,,,25.0300,ABST 15,SEC 30,COLLIN M BEASON,,,,,,,,0,0,32210,1400,0,0,0,0,32210,1400,0,0,0,0,0,0,0,0,0,0,0,0,0,False,0,False,False,0,0,0
2021,01,Coke Cad,1037,1-22-000160009001000000,1,8228,R,DEEN MRYA LYNN,,326 POVERTY CANYON RD,,TENNYSON,TX,76953,0096,22,01,02,04,05,11,24,,,,,,,False,326,POVERTY CANYON RD,,TENNYSON,TX,76953,,G6-13,PL-7,False,False,E1,,,,1.000000,0,0.00,H,,,1.0000,ABST 16,SEC 9.5,J. BLAND,,,,,,,,1500,0,0,0,0,0,0,0,59360,59360,0,0,0,0,0,0,0,0,0,57860,0,0,0,False,0,False,False,0,0,0
2021,01,Coke Cad,1040,1-22-000160009002100000,1,2948,R,MONTEZ WILFRED D,,6582 PLAINVIEW DR,,SAN ANGELO,TX,76905,0000,22,01,02,04,05,11,24,,,,,,,False,,,,,TX,,,,PL-7,False,False,D1W,,,,1.000000,0,0.00,,,,90.0500,ABST 16,SEC 9.5,J. BLAND,,,,,,,,0,0,131740,4800,0,0,0,0,131740,4800,0,0,0,0,0,0,0,0,0,0,0,0,0,False,0,False,False,0,0,0
2021,01,Coke Cad,1042,1-22-000160009004000000,1,8191,R,KNOX BROTHERS CATTLE,,P O BOX 60087,,SAN ANGELO,TX,76906,,22,01,02,04,05,11,24,,,,,,,False,,,,,TX,,,,PL-7,False,False,D1,,,,1.000000,0,0.00,,,,36.5230,ABST 16,SEC 9.5,J. BLAND,,,,,,,,0,0,32870,1460,0,0,0,0,32870,1460,0,0,0,0,0,0,0,0,0,0,0,0,0,False,0,False,False,0,0,0
2021,01,Coke Cad,1043,1-22-000160009004100000,1,8191,R,KNOX BROTHERS CATTLE,,P O BOX 60087,,SAN ANGELO,TX,76906,,22,01,02,04,05,11,24,,,,,,,False,,,,,,,,G6-13,PL-7,False,False,M1,,,,1.000000,0,0.00,,,,0.0000,ABST 16,SEC 9.5,J. BLAND,"DWMH ON A-16, LABEL NTA1455463&64",,,,,,,0,0,0,0,0,0,0,0,73760,73760,0,0,0,0,0,0,0,0,0,0,0,73760,0,False,0,False,False,0,0,0
2021,01,Coke Cad,1044,1-11-000180010001000000,1,1672,R,COPELAND JOHN G,,P O BOX 518,,STERLING CITY,TX,76951,0000,11,01,02,04,05,10,23,,,,,,,False,,,,,,,,,,False,False,D1,,,,0.515738,0,0.00,,,,29.4383,ABST 18,SEC 10,M. BURNETT,,,,,,,,0,0,35330,1440,0,0,0,0,35330,1440,0,0,0,0,0,0,0,0,0,0,0,0,0,False,0,False,False,0,0,0
2021,01,Coke Cad,1044,1-11-000180010001000000,2,1073,R,ANDERSON JANE B,,6034 DESCO,,DALLAS,TX,75225,0000,11,01,02,04,05,10,23,,,,,,,False,,,,,,,,,,False,False,D1,,,,0.484262,0,0.00,,,,27.6417,ABST 18,SEC 10,M. BURNETT,,,,,,,,0,0,33170,1360,0,0,0,0,33170,1360,0,0,0,0,0,0,0,0,0,0,0,0,0,False,0,False,False,0,0,0
2021,01,Coke Cad,1046,1-11-000180010002000000,1,2920,R,MILLICAN WALDON,,11681 W ST HWY 158,,ROBERT LEE,TX,76945,0000,11,01,02,04,05,10,23,,,,,,,False,,,,,,,,,,False,False,D1,,,,1.000000,0,0.00,,,,333.2000,ABST 18,SEC 10,M. BURNETT,,,,,,,,0,0,333200,14660,0,0,0,0,333200,14660,0,0,0,0,0,0,0,0,0,0,0,0,0,False,0,False,False,0,0,0
2021,01,Coke Cad,1047,1-11-000180010003000000,1,3225,R,"ABCT PRICE, LTD",,1503 FLOYD DR,,SAN ANGELO,TX,76904,0000,11,01,02,04,05,10,23,,,,,,,False,,,,,,,,,,False,False,D1,,,,0.791600,0,0.00,,,,196.4118,ABST 18,SEC 10,M. BURNETT,,,,,,,,0,0,193360,8400,0,0,0,0,193360,8400,0,0,0,0,0,0,0,0,0,0,0,0,0,False,0,False,False,0,0,0
2021,01,Coke Cad,1047,1-11-000180010003000000,2,3230,R,PRICE LABECCA STERLING PRICE TRUST,LABECCA PRICE BUSELLI TRUSTEE,1506 FLOYD DR,,SAN ANGELO,TX,76904,9009,11,01,02,04,05,10,23,,,,,,,False,,,,,,,,,,False,False,D1,,,,0.104200,0,0.00,,,,25.8541,ABST 18,SEC 10,M. BURNETT,,,,,,,,0,0,25450,1110,0,0,0,0,25450,1110,0,0,0,0,0,0,0,0,0,0,0,0,0,False,0,False,False,0,0,0
2021,01,Coke Cad,1047,1-11-000180010003000000,3,3226,R,PRICE COOPER REID TRUST,,6106 KATIE LN,,SAN ANGELO,TX,76904,1402,11,01,02,04,05,10,23,,,,,,,False,,,,,,,,,,False,False,D1,,,,0.104200,0,0.00,,,,25.8541,ABST 18,SEC 10,M. BURNETT,,,,,,,,0,0,25450,1110,0,0,0,0,25450,1110,0,0,0,0,0,0,0,0,0,0,0,0,0,False,0,False,False,0,0,0
2021,01,Coke Cad,1054,1-11-000180010009500000,1,7720,R,WILDCAT MOUNTAIN RANCH LTD,W A FARRIS,5429 LBJ FRWY #625,,DALLAS,TX,75240,,11,01,02,04,05,10,23,,,,,,,False,,,,,,,,,,False,False,D1,D2,,,1.000000,0,0.00,,,,2645.7900,ABST 18,SEC 10,M BURNETT,,,,,,,,0,0,2469010,114200,0,0,0,0,2471440,116630,0,0,0,0,0,0,0,0,0,0,0,2430,0,False,0,False,False,0,0,0
2021,01,Coke Cad,1056,1-22-000840011009500000,1,7063,R,ALEXANDRIS VALERIE,,2005 HILL HAVEN CIRCLE,,RICHARDSON,TX,75081,,22,01,02,04,05,11,24,,,,,,,False,,,,,,,,G6-2,,False,False,E,,,,0.500000,0,0.00,,,,0.0000,ABST 84,SEC 11,G. DEWITT,,,,,,,,0,0,0,0,0,0,0,0,4890,4890,0,0,0,0,0,0,0,0,0,0,0,4890,0,False,0,False,False,0,0,0
2021,01,Coke Cad,1056,1-22-000840011009500000,2,7607,R,JOHNSON EMANUEL,VALERIE ALEXANDRIS,2005 HILL HAVEN CIRCLE,,RICHARDSON,TX,75081,,22,01,02,04,05,11,24,,,,,,,False,,,,,,,,G6-2,,False,False,E,,,,0.500000,0,0.00,,,,0.0000,ABST 84,SEC 11,G. DEWITT,,,,,,,,0,0,0,0,0,0,0,0,4890,4890,0,0,0,0,0,0,0,0,0,0,0,4890,0,False,0,False,False,0,0,0
2021,01,Coke Cad,1058,1-11-000190265001000000,1,8637,R,WOJTEK HARVEY NEIL & CARLA DYESS WOJTEK,,P O BOX 258,,ROBERT LEE,TX,76945,,11,01,02,04,05,10,23,,,,,,,False,,,,,TX,,,,,False,False,D1,,,,1.000000,0,0.00,,,,152.6660,ABST 19,,JOHN BOYD JR,,,,,,,,0,0,153680,7400,0,0,0,0,153680,7400,0,0,0,0,0,0,0,0,0,0,0,0,0,False,0,False,False,0,0,0
2021,01,Coke Cad,1059,1-11-000190265002000000,1,3645,R,SMITH WILLIS WAYNE,,P O BOX 356,,ROBERT LEE,TX,76945,0000,11,01,02,04,05,10,23,,,,,,,False,,,,,TX,,,,,False,False,D1,,,,1.000000,0,0.00,,,,46.0000,ABST 19,,JOHN BOYD JR,,,,,,,,0,0,48250,1890,0,0,0,0,48250,1890,0,0,0,0,0,0,0,0,0,0,0,0,0,False,0,False,False,0,0,0
2021,01,Coke Cad,1068,1-11-000200461001000000,2,8130,R,STANEI KARA F,,9737 RIO FRIO,,FORT WORTH,TX,76126,,11,01,02,04,05,10,23,,,,,,,False,,,,,TX,,,,,False,False,D1,,,,0.333400,0,0.00,,,,34.2792,ABST 20,SEC 461,JOSEPH BAKER,,,,,,,,0,0,45400,2160,0,0,0,0,45400,2160,0,0,0,0,0,0,0,0,0,0,0,0,0,False,0,False,False,0,0,0
2021,01,Coke Cad,1068,1-11-000200461001000000,3,8131,R,THOMPSON JON D,,7005 CATTLE BARRON COURT,,MIDLOTHIAN,TX,76065,,11,01,02,04,05,10,23,,,,,,,False,,,,,TX,,,,,False,False,D1,,,,0.333300,0,0.00,,,,34.2689,ABST 20,SEC 461,JOSEPH BAKER,,,,,,,,0,0,45390,2160,0,0,0,0,45390,2160,0,0,0,0,0,0,0,0,0,0,0,0,0,False,0,False,False,0,0,0
2021,01,Coke Cad,1068,1-11-000200461001000000,4,8132,R,THOMPSON SCOTT A,,2520 WABASH AVE,,FORT WORTH,TX,76109,,11,01,02,04,05,10,23,,,,,,,False,,,,,TX,,,,,False,False,D1,,,,0.333300,0,0.00,,,,34.2689,ABST 20,SEC 461,JOSEPH BAKER,,,,,,,,0,0,45390,2160,0,0,0,0,45390,2160,0,0,0,0,0,0,0,0,0,0,0,0,0,False,0,False,False,0,0,0
2021,01,Coke Cad,1069,1-22-000210453001500000,1,9107,R,HUGHES MARIAN ELISE MAYS,,1518 DARLENE ST,,SAN ANGELO,TX,76904,,22,01,02,04,05,11,24,,,,,,,False,,,,,TX,,,,,False,False,D1,,,,1.000000,0,0.00,,,,340.6700,ABST 21,SEC 453,JOHANN BALDUS,,,,,,,,0,0,325200,14250,0,0,0,0,325200,14250,0,0,0,0,0,0,0,0,0,0,0,0,0,False,0,False,False,0,0,0
2021,01,Coke Cad,1071,1-11-000220519001000000,1,1810,R,DOCOTO FLP,,1247 CR 142,,OVALO,TX,79541,0000,11,01,02,04,05,10,23,,,,,,,False,,,,,TX,,,,,False,False,D1,,,,1.000000,0,0.00,,,,113.0000,ABST 22,SEC 519,PETER BALMERT,,,,,,,,0,0,105300,4650,0,0,0,0,105300,4650,0,0,0,0,0,0,0,0,0,0,0,0,0,False,0,False,False,0,0,0
2021,01,Coke Cad,1072,1-11-000230520001000000,1,1810,R,DOCOTO FLP,,1247 CR 142,,OVALO,TX,79541,0000,11,01,02,04,05,10,23,,,,,,,False,,,,,TX,,,,,False,False,D1,,,,1.000000,0,0.00,,,,126.5000,ABST 23,SEC 520,PETER BALMERT,,,,,,,,0,0,122250,5330,0,0,0,0,122250,5330,0,0,0,0,0,0,0,0,0,0,0,0,0,False,0,False,False,0,0,0
2021,01,Coke Cad,1073,1-11-000240527001000000,1,2679,R,LSAT SPORTS CLUB LLC,,P O BOX 1490,,MIDLAND,TX,79702,0000,11,01,02,04,05,10,23,,,,,,,False,,,,,TX,,,,,False,False,D1W,,,,1.000000,0,0.00,,,,143.5000,ABST 24,SEC 527,CARL BENGENDORF,,,,,,,,0,0,157850,5740,0,0,0,0,157850,5740,0,0,0,0,0,0,0,0,0,0,0,0,0,False,0,False,False,0,0,0
2021,01,Coke Cad,1074,1-11-000250528001000000,1,2679,R,LSAT SPORTS CLUB LLC,,P O BOX 1490,,MIDLAND,TX,79702,0000,11,01,02,04,05,10,23,,,,,,,False,,,,,TX,,,,,False,False,D1W,,,,1.000000,0,0.00,,,,131.4000,ABST 25,SEC 528,CARL BENGENDORF,,,,,,,,0,0,144540,5260,0,0,0,0,144540,5260,0,0,0,0,0,0,0,0,0,0,0,0,0,False,0,False,False,0,0,0
2021,01,Coke Cad,1075,1-11-000260471001000000,1,8633,R,VALADEZ JOE L,,140 NORMA ST,,SAN ANGELO,TX,76903,,11,01,02,04,05,10,23,,,,,,,False,,,,,TX,,,,PL-5,False,False,D1,D2,,,1.000000,0,0.00,,,,23.3400,ABST 26,SEC 471,G. BLUTHART,,,,,,,,0,0,64470,1490,0,0,0,0,65440,2460,0,0,0,0,0,0,0,0,0,0,0,0,970,False,0,False,False,0,0,0
2021,01,Coke Cad,1076,1-11-000260471002000000,1,9489,R,JC WERNER RANCH LLC,,5617 ASHWOOD CT,,MIDLAND,TX,79707,,11,01,02,04,05,10,23,,,,,,,False,,,,,TX,,,,,False,False,D1W,,,,1.000000,0,0.00,,,,208.5000,ABST 26,SEC 471,G. BLUTHART,,,,,,,,0,0,250330,9090,0,0,0,0,250330,9090,0,0,0,0,0,0,0,0,0,0,0,0,0,False,0,False,False,0,0,0
2021,01,Coke Cad,1088,1-11-000270470001000000,1,7553,R,GRAHAM RICKEY & PAULA,,4025 WEST FM 1606,,IRA,TX,79527,,11,01,02,04,05,10,23,,,,,,,False,,,,,TX,,,,,False,False,D1,,,,1.000000,0,0.00,,,,10.0000,ABST 27,SEC 470,G. BLUTHART,,,,,,,,0,0,11220,400,0,0,0,0,11220,400,0,0,0,0,0,0,0,0,0,0,0,0,0,False,0,False,False,0,0,0
2021,01,Coke Cad,1089,1-11-000270470002000000,1,2753,R,MCADAMS MARY JANE TRUST,,6125 STAGECOACH TRL,,SAN ANGELO,TX,76901,0000,11,01,02,04,05,10,23,,,,,,,False,,,,,TX,,,E4,8,False,False,D1,D2,,,1.000000,0,0.00,,,,310.0000,ABST 27,SEC 470,G. BLUTHART,,,,,,,,0,0,342500,13020,0,0,0,0,360290,30810,0,0,0,0,0,0,0,0,0,0,0,17790,0,False,0,False,False,0,0,0
2021,01,Coke Cad,1094,1-11-000280502001000000,1,8602,R,LEWIS GEORGE R,,4902 CASTLEFORD RD,,MIDLAND,TX,79705,,11,01,02,04,05,10,23,,,,,,,False,,,,,TX,,,,,False,False,D1,,,,1.000000,0,0.00,,,,132.3300,ABST 28,SEC 502,JOHANN BIWER,,,,,,,,0,0,140830,5430,0,0,0,0,140830,5430,0,0,0,0,0,0,0,0,0,0,0,0,0,False,0,False,False,0,0,0
2021,01,Coke Cad,1101,1-22-001330330020000000,1,3176,R,GOODSON JAN PHILLIPS,,18106 DARLING POINT,,CYPRESS,TX,77429,0000,22,01,02,04,05,11,24,,,,,,,False,,,,,TX,,,,,False,False,D1,,,,0.333334,0,0.00,,,,14.6667,ABST 133,SEC 330,NICHOLAS EASTLAND,,,,,,,,0,0,18170,640,0,0,0,0,18170,640,0,0,0,0,0,0,0,0,0,0,0,0,0,False,0,False,False,0,0,0
2021,01,Coke Cad,1101,1-22-001330330020000000,2,4070,R,WILKINS JERRY C,,P O BOX 95,,BRONTE,TX,76933,0000,22,01,02,04,05,11,24,,,,,,,False,,,,,TX,,,,,False,False,D1,,,,0.333333,0,0.00,,,,14.6667,ABST 133,SEC 330,NICHOLAS EASTLAND,,,,,,,,0,0,18170,640,0,0,0,0,18170,640,0,0,0,0,0,0,0,0,0,0,0,0,0,False,0,False,False,0,0,0
2021,01,Coke Cad,1101,1-22-001330330020000000,3,4071,R,WILKINS JOE DON,,6409 SCRIBNER RD,,HOUSTON,TX,77074,0000,22,01,02,04,05,11,24,,,,,,,False,,,,,TX,,,,,False,False,D1,,,,0.333333,0,0.00,,,,14.6667,ABST 133,SEC 330,NICHOLAS EASTLAND,,,,,,,,0,0,18170,640,0,0,0,0,18170,640,0,0,0,0,0,0,0,0,0,0,0,0,0,False,0,False,False,0,0,0
2021,01,Coke Cad,1102,1-21-001340331002200000,1,7128,R,BERRYHILL ROBERT,,1028 MESQUITE STREET,,BRONTE,TX,76933,,21,01,02,04,05,12,11,24,,,,,,False,1028,MESQUITE STREET,,BRONTE,TX,76933,,G4-1,,False,False,E1,,,,1.000000,0,0.00,H,,,1.0000,ABST 134,SEC 331,NICHOLAS EASTLAND,,,,,,,,1500,0,0,0,0,0,0,0,123590,123590,0,0,0,0,0,0,0,0,0,122090,0,0,0,False,0,False,False,0,0,0
2021,01,Coke Cad,1103,1-21-001350329003000000,1,7174,R,BARNETT DAVID WAYNE,,3340 S 21ST,,ABILENE,TX,79605,,21,01,02,04,05,12,11,24,,,,,,False,,,,,TX,,,H4-3,,False,False,E1,,,,1.000000,0,0.00,,,,4.0000,ABST 135,SEC 329,NICHOLAS EASTLAND,,,,,,,,0,6000,0,0,0,0,0,0,22000,22000,0,0,0,0,0,0,0,0,0,0,0,4900,11100,False,0,False,False,0,0,0
2021,01,Coke Cad,1108,1-11-000310526001000000,1,6824,R,MILLICAN TERRY JOE,,P O BOX 98,,SEMINOLE,TX,79360,,11,01,02,04,05,10,23,,,,,,,False,,,,,TX,,,,,False,False,D1,,,,1.000000,0,0.00,,,,131.8900,ABST 31,SEC 526,CARL BROCKHUYSEN,,,,,,,,0,0,153190,5570,0,0,0,0,153190,5570,0,0,0,0,0,0,0,0,0,0,0,0,0,False,0,False,False,0,0,0
2021,01,Coke Cad,1112,1-30-000321552001000000,1,2708,R,MARCH RANCH REVOCABLE TRUST,"TEXAS STATE BANK, TRUSTEE, MGR",P O BOX 3782,,SAN ANGELO,TX,76902,0000,30,01,02,04,05,10,20,,,,,,,False,,,,,TX,,,,PL-1,False,False,D1,,,,1.000000,0,0.00,,,,3.0400,ABST 32,SEC 1152,J. BARTON,,,,,,,,0,0,2370,100,0,0,0,0,2370,100,0,0,0,0,0,0,0,0,0,0,0,0,0,False,0,False,False,0,0,0
2021,01,Coke Cad,1113,1-30-000321552002000000,1,6684,R,STONE SCRUB OAKS RANCH LTD,,"3471 KNICKERBOCKER RD., STE. 513",,SAN ANGELO,TX,76904,,30,01,02,04,05,10,20,,,,,,,False,,,,,TX,,,,,False,False,D1,,,,1.000000,0,0.00,,,,2.9600,ABST 32,SEC 1152,J. BARTON,,,,,,,,0,0,3550,150,0,0,0,0,3550,150,0,0,0,0,0,0,0,0,0,0,0,0,0,False,0,False,False,0,0,0
2021,01,Coke Cad,1115,1-30-000330001001000000,1,1618,R,CMB RANCH LLC,,15909 MCNORTON,,SPLENDORA,TX,77372,0000,30,01,02,04,05,10,20,,,,,,,False,,,,,TX,,,,,False,False,D1,,,,1.000000,0,0.00,,,,6.6000,ABST 33,SEC 1,S. BOSTICK,,,,,,,,0,0,9570,320,0,0,0,0,9570,320,0,0,0,0,0,0,0,0,0,0,0,0,0,False,0,False,False,0,0,0
2021,01,Coke Cad,1116,1-30-000330001002000000,1,7124,R,EDWARDS ELIZABETH M LVG TRUST,BETH R EDWARDS,560 E SADDLE DR,,GRAND JUNCTION,CO,81507,9754,30,01,02,04,05,10,20,,,,,,,False,,,,,TX,,,,,False,False,D1W,,,,1.000000,0,0.00,,,,1.6000,ABST 33,SEC 1,S. BOSTICK,,,,,,,,0,0,2320,80,0,0,0,0,2320,80,0,0,0,0,0,0,0,0,0,0,0,0,0,False,0,False,False,0,0,0
2021,01,Coke Cad,1117,1-30-000330001003000000,1,2882,R,MICHALEWICZ ERNEST,,5210 BRIARWOOD DR,,SAN ANGELO,TX,76903,0000,30,01,02,04,05,10,20,,,,,,,False,,,,,TX,,,,,False,False,D1,,,,1.000000,0,0.00,,,,455.6200,ABST 33,SEC 1,S. BOSTICK,,,,,,,,0,0,548890,34330,0,0,0,0,548890,34330,0,0,0,0,0,0,0,0,0,0,0,0,0,False,0,False,False,0,0,0
2021,01,Coke Cad,1121,1-30-000330001004000000,1,2881,R,MICHALEWICZ ARNOLD J,,P O BOX 307,,WATER VALLEY,TX,76958,0000,30,01,02,04,05,10,20,,,,,,,False,,,,,TX,,,,,False,False,D1,,,,1.000000,0,0.00,,,,114.5000,ABST 33,SEC 1,S. BOSTICK,,,,,,,,0,0,140970,4980,0,0,0,0,140970,4980,0,0,0,0,0,0,0,0,0,0,0,0,0,False,0,False,False,0,0,0